{"text_format":"1","workbook":"xlsx","n_sheets":8,"sheets":["Salariés","1- écart rémunération","2- écart augmentations","2 - message","3- AI maternité","4- 10 + hautes rému","index","barèmes"],"not_rendered":{"charts":0,"images":1,"macros":1,"external_links":0,"defined_names":11,"comments":2,"pivot_tables":0},"unopened":[],"bounds":{"document_bytes":16777216,"sheet_cells":100000,"rows_first":2000,"rows_last":500,"rows_between":2000,"halvings":0,"cell_chars":16384,"cell_head_chars":4096},"cells_cut":0,"cells_raw":0,"read":"whole","date_system":"1900"}

{"sheet":"Salariés","index":0,"n_rows":149,"n_cols":23,"rows_kept":149,"cut":false,"hidden":false,"merged":[]}
[]
[null,"x","Remplir les données de votre entreprise",null,null,"Les données ci-dessous recenssent le personnel au 31/12/2019, non démissionnaire et hors procédure de départ. Le directeur général en a été retiré. "]
[null,"x","Ne pas modifier: valeur calculée automatiquement"]
[]
[null,"Date du jour",null,"2019-06-30"]
[]
[]
[null,"N°","PRENOM","NOM","SEXE","DATE NAISSANCE","DATE EMBAUCHE","CATEGORIE","SERVICE","EMPLOI","CONTRAT","DUREE DU TRAVAIL","HORAIRES","PROMOTIONS","HEURES FORMATION (EXTERNE UNIQUEMENT) N-1","BRUT ANNUEL (hors hsup/anc) /12","AUGMENTATION AU COURS DES 12 DERNIERS MOIS","NOMBRE D'ACCIDENTS DU TRAVAIL/MP","Age","Ancienneté","Tranche âge","Tranche ancienneté","Tranches rémunération"]
[null,1000,"LUCIENNE","DUBOS","F","2004-04-04","2029-08-10","3. Cadre","Qualité","Responsable Qualité","CDI","TC","FORFAIT","0",77,40477.995000000003,2.7E-2,0,{"$f":"INT((date_jour-$F9)/365.25)","v":15},{"$f":"INT((date_jour-$G9)/365.25)","v":-11},{"$f":"tranche_age(S9)","v":"1. moins de 30 ans"},{"$f":"IF(ISNUMBER(T9),IF(T9=0,\"0 : - d'1 an\",INT(T9/5)+1&\" : \"&IF(INT(T9/5)=0,1,INT(T9/5)*5)&\"-\"&INT(T9/5)*5+4),\"\")","v":"-2 : -15--11"},{"$f":"IF(P9=0,\" \",(IF(P9<20000,\"<20000\",IF(P9<=30000,\"1:20000-30000\",IF(P9<=45000,\"2:30000-45000\",IF(P9<=60000,\"3:45000-60000\",\"4:<60000\"))))))","v":"2:30000-45000"}]
[null,1001,"ANNETTE","HENRION","F","1972-07-03","2030-04-16","2. Etam","R&D","Technicien essais","CDI","TC","JOURNEE","0",40,21306.05,0.02,0,46,-11,{"$f":"tranche_age(S10)","v":"3. 40 à 49 ans"},"-2 : -15--11","1:20000-30000"]
[null,1002,"MATHILDE","ROSSET","F","1985-08-09","2008-03-24","2. Etam","Marketing","Assistante Commerciale","CDI","TC","JOURNEE","0",0,32793.360000000001,0,0,33,11,{"$f":"tranche_age(S11)","v":"2. 30 à 49 ans"},"3 : 10-14","2:30000-45000"]
[null,1003,"MARIE-LOUISE","BELAIR","H","1957-10-22","1992-11-13","3. Cadre","Qualité","Responsable Qualité","CDI","TC","FORFAIT","0",7,62779.839599999992,0.02,0,61,26,{"$f":"tranche_age(S12)","v":"4. 50 ans et plus"},"6 : 25-29","4:<60000"]
[null,1004,"JEANNINE","SEUX","F","1957-02-17","1989-09-18","1. Ouvrier","Fabrication","Agent de Fabrication","CDI","TC","EQUIPE","0",10.5,24129.42,0.01,0,62,29,{"$f":"tranche_age(S13)","v":"4. 50 ans et plus"},"6 : 25-29","1:20000-30000"]
[null,1005,"CASSANDRA","COUDERC","H","1964-06-18","1996-09-24","2. Etam","Fabrication","Technicien Fabrication","CDI","TC","JOURNEE","0",0,26645.22,0,0,55,22,{"$f":"tranche_age(S14)","v":"4. 50 ans et plus"},"5 : 20-24","1:20000-30000"]
[null,1006,"BERNADETTE","BONHOURE","H","1959-06-23","1992-06-16","3. Cadre","R&D","Ingénieur Méthodes","CDI","TC","FORFAIT","0",24.5,36300.708000000006,0.02,0,60,27,{"$f":"tranche_age(S15)","v":"4. 50 ans et plus"},"6 : 25-29","2:30000-45000"]
[null,1007,"HOURIA","GARRET","F","1958-05-25","1992-05-06","1. Ouvrier","Fabrication","Contrôleur","CDI","TC","EQUIPE","1",0,24934.739999999998,2.2499999999999999E-2,0,61,27,{"$f":"tranche_age(S16)","v":"4. 50 ans et plus"},"6 : 25-29","1:20000-30000"]
[null,1008,"PIERRETTE","METAIS","F","1980-04-14","2012-06-09","3. Cadre","Qualité","Chargé d'Affaires","CDI","TC","FORFAIT","0",28,37174.842000000004,2.2499999999999999E-2,0,39,7,{"$f":"tranche_age(S17)","v":"2. 30 à 49 ans"},"2 : 5-9","2:30000-45000"]
[null,1009,"MOUNA","GITTON","F","1960-12-01","2011-05-01","1. Ouvrier","Ordo & logistique","Agent de Fabrication","CDI","TC","EQUIPE","0",54,23875.129999999997,1.7500000000000002E-2,0,58,8,{"$f":"tranche_age(S18)","v":"4. 50 ans et plus"},"2 : 5-9","1:20000-30000"]
[null,1010,"AMÉLIE","ADOLPHE","F","1962-06-22","1999-11-28","1. Ouvrier","Fabrication","Agent de Fabrication","CDI","TC","EQUIPE","1",10.5,19086.689999999999,0.04,0,57,19,{"$f":"tranche_age(S19)","v":"4. 50 ans et plus"},"4 : 15-19","<20000"]
[null,1011,"VIVIEN","PIVETEAU","H","1988-03-27","2013-05-23","2. Etam","Fabrication","Technicien de Fabrication","CDI","TC","EQUIPE","0",45.5,30426.639999999999,4.4999999999999998E-2,0,31,6,{"$f":"tranche_age(S20)","v":"2. 30 à 49 ans"},"2 : 5-9","2:30000-45000"]
[null,1012,"LUCIA","LEROUX","F","1968-06-08","2015-05-11","1. Ouvrier","Fabrication","Agent de Fabrication","CDI","TC","EQUIPE","0",0,21201.48,1.4999999999999999E-2,0,51,4,{"$f":"tranche_age(S21)","v":"4. 50 ans et plus"},"1 : 1-4","1:20000-30000"]
[null,1013,"SAMANTHA","MICHON","F","1972-08-30","1994-06-25","2. Etam","Qualité","Contrôleur","CDI","TC","EQUIPE","0",0,27880.3,2.2499999999999999E-2,0,46,25,{"$f":"tranche_age(S22)","v":"3. 40 à 49 ans"},"6 : 25-29","1:20000-30000"]
[null,1014,"JONATHAN","ANCEL","H","1974-03-22","2002-08-06","3. Cadre","R&D","Ingénieur Dévelop.","CDI","TC","FORFAIT","0",60,38384.370000000003,0.03,0,45,16,{"$f":"tranche_age(S23)","v":"3. 40 à 49 ans"},"4 : 15-19","2:30000-45000"]
[null,1015,"CHARLIE","SERRE","F","1981-03-20","2020-02-12","2. Etam","Administration","Assistante Admin et Production","CDI","TC","JOURNEE","0",14,23290.149999999998,1.7500000000000002E-2,0,38,-1,{"$f":"tranche_age(S24)","v":"2. 30 à 49 ans"},"0 : -5--1","1:20000-30000"]
[null,1016,"MAYLANE","DESMET","F","1996-11-26","2035-05-02","1. Ouvrier","Fabrication","Agent de Fabrication","CDI","TC","EQUIPE","0",0,19793.259999999998,3.2500000000000001E-2,0,22,-16,{"$f":"tranche_age(S25)","v":"1. moins de 30 ans"},"-3 : -20--16","<20000"]
[null,1017,"GASPARD","COUTURE","H","1988-09-28","2011-01-09","2. Etam","Fabrication","Technicien de Fabrication","CDI","TC","JOURNEE","1",10.5,32245.429999999997,0.01,0,30,8,{"$f":"tranche_age(S26)","v":"2. 30 à 49 ans"},"2 : 5-9","2:30000-45000"]
[null,1018,"MARIE-HÉLÈNE","MEIGNAN","F","1999-07-29","2025-11-07","1. Ouvrier","Fabrication","Agent de Fabrication","CDI","TC","EQUIPE","0",0,24669.94,4.4999999999999998E-2,0,19,-7,{"$f":"tranche_age(S27)","v":"1. moins de 30 ans"},"-1 : -10--6","1:20000-30000"]
[null,1019,"MARTIAL","FOUCHARD","H","1991-05-19","2034-11-29","3. Cadre","R&D","Ingénieur Dévelop.","CDI","TC","FORFAIT","0",14,55521.631999999998,1.4999999999999999E-2,0,28,-16,{"$f":"tranche_age(S28)","v":"1. moins de 30 ans"},"-3 : -20--16","3:45000-60000"]
[null,1020,"MÉLANIE","FABRY","F","1968-03-12","2022-08-06","1. Ouvrier","Fabrication","Agent de Fabrication","CDI","TC","EQUIPE","0",0,22659.21,1.4999999999999999E-2,0,51,-4,{"$f":"tranche_age(S29)","v":"4. 50 ans et plus"},"0 : -5--1","1:20000-30000"]
[null,1021,"YVETTE","GUIHENEUF","F","1981-04-04","2004-11-10","3. Cadre","Réglementaire/Clinique","Chef Comptable","CDI","TC","FORFAIT","0",7,37498.008000000002,2.5000000000000001E-2,0,38,14,{"$f":"tranche_age(S30)","v":"2. 30 à 49 ans"},"3 : 10-14","2:30000-45000"]
{"$rows_left_out":120}
{"sheet":"1- écart rémunération","index":1,"n_rows":30,"n_cols":11,"rows_kept":30,"cut":false,"hidden":false,"merged":[[9,0,10,0],[9,2,9,3],[9,4,10,4],[9,1,10,1],[23,0,23,1],[15,0,18,0],[11,0,14,0],[19,0,22,0],[23,6,23,7],[7,3,7,10],[9,8,10,8],[9,10,10,10],[9,9,10,9],[9,5,10,5],[9,6,9,7]]}
["1- Indicateur d'écart de rémunération"]
[]
["Saisir vos données dans les seules cellules vertes. Ne rien saisir dans les autres cellules. "]
["Les résultats apparaissent dans les cellules jaunes. Ils peuvent être accompagnés de commentaires pour les interpréter. "]
["Ne renseigner les salaires moyens que lorsqu'ils sont calculés sur au moins trois personnes."]
[]
["Catégories de postes équivalents :",null,"4 CSP","Par défaut, les catégories de postes équivalents sont les 4 catégories socioprofessionnelles (CSP)."]
["Seuil de pertinence associé :",null,0.05,"Par défaut, le seuil de pertinence est fixé à 5 % (pour une catégorisation en 4 CSP). Pour toute autre catégorisation, il est fixé à 2 %. Remplacer 5 % par 2 % si vous êtes dans ce cas."]
[]
["catégorie socioprofessionnelle (CSP)","tranche d'âge","rémunération annuelle brute moyenne par EQTP",null,"écart de rémunération moyenne","écart après application du seuil de pertinence","nombre de salariés",null,"validité du groupe (1=oui, 0=non)","effectifs valides (groupes pris en compte)","écart pondéré"]
[null,null,"femmes","hommes",null,null,"femmes","hommes"]
["ouvriers","moins de 30 ans",null,null,{"$f":"IF(AND(C12>0,D12>0),(D12-C12)/D12,\" \")","v":" "},{"$f":"IF(ISNUMBER(E12),SIGN(E12)*MAX(0,ABS(E12)-$C$8),\" \")","v":" "},null,null,{"$f":"IF(AND(G12>=3,H12>=3),1,0)","v":0},{"$f":"I12*SUM(G12:H12)","v":0},{"$f":"IF(I12=1,F12*J12/J$24,0)","v":0}]
[null,"30 à 39 ans",null,null,{"$f":"IF(AND(C13>0,D13>0),(D13-C13)/D13,\" \")","v":" "},{"$f":"IF(ISNUMBER(E13),SIGN(E13)*MAX(0,ABS(E13)-$C$8),\" \")","v":" "},null,null,{"$f":"IF(AND(G13>=3,H13>=3),1,0)","v":0},{"$f":"I13*SUM(G13:H13)","v":0},0]
[null,"40 à 49 ans",null,null," "," ",null,null,0,0,0]
[null,"50 ans et plus",null,null," "," ",null,null,0,0,0]
["techniciens et agents de maîtrise","moins de 30 ans",null,null," "," ",null,null,0,0,0]
[null,"30 à 39 ans",null,null," "," ",null,null,0,0,0]
[null,"40 à 49 ans",null,null,{"$f":"IF(AND(C18>0,D18>0),(D18-C18)/D18,\" \")","v":" "}," ",null,null,0,0,0]
[null,"50 ans et plus",null,null," "," ",null,null,0,0,0]
["ingénieurs et cadres","moins de 30 ans",null,null," "," ",null,null,0,0,0]
[null,"30 à 39 ans",null,null," "," ",null,null,0,0,0]
[null,"40 à 49 ans",null,null," "," ",null,null,0,0,0]
[null,"50 ans et plus",null,null," "," ",null,null,0,0,0]
["ensemble des salariés",null,{"$f":"SUMPRODUCT(C12:C23,G12:G23)/SUM(G12:G23)","v":{"$error":"#DIV/0!"}},{"$f":"SUMPRODUCT(D12:D23,H12:H23)/SUM(H12:H23)","v":{"$error":"#DIV/0!"}},{"$f":"IF(AND(C24>0,D24>0),(D24-C24)/D24,\" \")","v":{"$error":"#DIV/0!"}},null,{"$f":"SUM(G12:H23)","v":0},null,null,{"$f":"SUM(J12:J23)","v":0},{"$f":"SUM(K12:K23)","v":0}]
[]
["Pour des catégories de postes équivalents plus fines que les 4 CSP, dupliquer et insérer les lignes 12 à 15 après la ligne 19 autant de fois que nécessaire et modifier les intitulés de catégories de postes."]
[]
["indicateur calculable (1=oui, 0=non) :",null,null,{"$f":"IF(G24>0,IF(J24>=40%*G24,1,0),\"#N/A\")","v":"#N/A"},{"$f":"IF(D28=1,\"Les effectifs valides représentent plus de 40 % des effectifs totaux.\",IF(D28=0,\"Les effectifs valides représentent moins de 40 % des effectifs totaux.\",\" \"))","v":" "}]
["indicateur d'écart de rémunération (%) :",null,null,{"$f":"IF(D28=1,ABS(ROUND(100*K24,1)),IF(D28=0,\"INCALCULABLE\",\"#N/A\"))","v":"#N/A"},{"$f":"IF(AND(K24>0,D28=1),\"Un écart de rémunération est constaté en faveur des hommes.\",IF(AND(K24<0,D28=1),\"Un écart de rémunération est constaté en faveur des femmes.\",\" \"))","v":" "}]
["note obtenue sur 40 :",null,null,{"$f":"VLOOKUP(D29,barèmes!B5:C26,2)","v":{"$error":"#N/A"}}]
{"$rows_left_out":1}
{"sheet":"2- écart augmentations","index":2,"n_rows":20,"n_cols":10,"rows_kept":20,"cut":false,"hidden":false,"merged":[[6,0,7,0],[6,1,6,2],[6,8,7,8],[15,4,16,9],[6,3,6,4],[6,5,6,6],[6,7,7,7],[6,9,7,9]]}
["2- indicateur d'écart de taux d'augmentations individuelles"]
[]
["Saisir vos données dans les seules cellules vertes. Ne rien saisir dans les autres cellules. "]
["Les résultats apparaissent dans les cellules jaunes. Ils peuvent être accompagnés de commmentaires pour les interpréter. "]
["En l'absence de modification de votre part, les nombres de salariés sont calculés d'après les données renseignées pour l'indicateur d'écarts de rémunération (cellules grises)."]
[]
[null,"nombre de salariés augmentés au cours de la période de référence *",null,"nombre de salariés",null,"taux d'augmentation",null,"écart de taux d'augmen-tation","écart absolu de taux d'augmen-tation","écart en nombre équivalent de salariés"]
[null,"femmes","hommes","femmes","hommes","femmes","hommes"]
["ensemble des salariés",null,null,{"$f":"SUM('1- écart rémunération'!G12:G23)","v":0},{"$f":"SUM('1- écart rémunération'!H12:H23)","v":0},{"$f":"B9/D9","v":{"$error":"#DIV/0!"}},{"$f":"C9/E9","v":{"$error":"#DIV/0!"}},{"$f":"G9-F9","v":{"$error":"#DIV/0!"}},{"$f":"IF(AND(0<=B9,B9<=D9,0<=C9,C9<=E9),ABS(F9-G9),\"#VALEUR!\")","v":{"$error":"#DIV/0!"}},{"$f":"I9*MIN(D9,E9)","v":{"$error":"#DIV/0!"}}]
["* Seules les augmentations individuelles du salaire de base sont à prendre en compte, qu'elles correspondent ou non à une promotion. ",null,null,null,null,null,null,null,{"$f":"IF(I9=\"#VALEUR!\",\"Incohérence dans les nombres de salariés saisis.\",\" \")","v":{"$error":"#DIV/0!"}}]
["Il ne faut comptabiliser les salariés augmentés que parmi ceux qui entrent dans le calcul de l'index."]
["La période de référence retenue pour évaluer la présence d'augmentations peut être allongée à deux ou trois ans. Son caractère pluriannuel peut alors être révisé tous les trois ans"]
[]
["indicateur calculable (1=oui, 0=non) :",null,null,{"$f":"IF(AND(ISBLANK(B9),ISBLANK(C9)),\"#N/A\",IF(AND(D9>=5,E9>=5,B9+C9>0),1,0))","v":"#N/A"},{"$f":"IF(D14=1,\"Il y a eu des augmentations et les effectifs comportent au moins 5 femmes et 5 hommes.\",IF(OR(D9<5,E9<5),\"Les effectifs comprennent moins de 5 femmes ou moins de 5 hommes.\",IF(AND(ISBLANK(B9),ISBLANK(C9)),\" \",\"Il n'y a pas eu d'augmentations dans l'entreprise.\")))","v":"Les effectifs comprennent moins de 5 femmes ou moins de 5 hommes."}]
["écart absolu de taux d'augmentation (points de %) :",null,null,{"$f":"IF(D14=1,ABS(ROUND(100*I9,1)),IF(D14=0,\"INCALCULABLE\",\"#N/A\"))","v":"#N/A"},{"$f":"IF(AND(H9>=0.05%,D14=1),\"Un écart de taux d'augmentation est constaté en faveur des hommes.\",IF(AND(H9<=-0.05%,D14=1),\"Un écart de taux d'augmentation est constaté en faveur des femmes.\",\" \"))","v":{"$error":"#DIV/0!"}}]
["écart en nombre équivalent de salariés :",null,null,{"$f":"IF(D14=1,ABS(ROUND(J9,1)),IF(D14=0,\"INCALCULABLE\",\"#N/A\"))","v":"#N/A"},{"$f":"IF(AND(D14=1,H9>=0.05%,E9>=D9),'2 - message'!C4,IF(AND(D14=1,H9>=0.05%,E9<D9),'2 - message'!C5,IF(AND(D14=1,H9<=-0.05%,E9<=D9),'2 - message'!C8,IF(AND(D14=1,H9<=-0.05%,D9<E9),'2 - message'!C7,\" \"))))","v":{"$error":"#DIV/0!"}}]
[]
["note correspondant à l'écart absolu de taux d'augmentation :",null,null,{"$f":"IF('1- écart rémunération'!D28=1,IF(AND('1- écart rémunération'!D30<MAX(barèmes!C5:C26), SIGN(H9)=-SIGN('1- écart rémunération'!K24)),MAX(barèmes!F5:F8),VLOOKUP(D15,barèmes!E5:F8,2)),VLOOKUP(D15,barèmes!E5:F8,2))","v":{"$error":"#N/A"}}]
["note correspondant à l'écart en nombre équivalent de salariés :",null,null,{"$f":"IF('1- écart rémunération'!D28=1,IF(AND('1- écart rémunération'!D30<MAX(barèmes!C5:C26), SIGN(H9)=-SIGN('1- écart rémunération'!K24)),MAX(barèmes!F5:F8),VLOOKUP(D16,barèmes!E5:F8,2)),VLOOKUP(D16,barèmes!E5:F8,2))","v":{"$error":"#N/A"}}]
["note obtenue sur 35 :",null,null,{"$f":"MAX(D18,D19)","v":{"$error":"#N/A"}},{"$f":"IF('1- écart rémunération'!D28=1,IF(AND('1- écart rémunération'!D30<MAX(barèmes!C5:C26), SIGN(H9)=-SIGN('1- écart rémunération'!K24),D15>=0.1),\"L'écart d'augmentations réduit l'écart de rémunération. Tous les points sont accordés.\",\" \"),\" \")","v":" "}]

{"sheet":"2 - message","index":3,"n_rows":12,"n_cols":3,"rows_kept":12,"cut":false,"hidden":true,"merged":[[1,2,2,2],[1,0,1,1]]}
[]
["Situation",null,"Message accompagnant l'écart en nombre équivalent de salariés :"]
["écart en faveur des :","Plus petit nombre de salariés :"]
["hommes","femmes","Si ce nombre de femmes supplémentaires avait bénéficié d'une augmentation, les taux d'augmentation seraient égaux entre hommes et femmes."]
["hommes","hommes","Si ce nombre d'hommes n'avait pas reçu d'augmentation parmi les bénéficiaires, les taux d'augmentation seraient égaux entre hommes et femmes."]
["hommes","égal",{"$f":"C4","v":"Si ce nombre de femmes supplémentaires avait bénéficié d'une augmentation, les taux d'augmentation seraient égaux entre hommes et femmes."}]
["femmes","femmes","Si ce nombre de femmes n'avait pas reçu d'augmentation parmi les bénéficiaires, les taux d'augmentation seraient égaux entre hommes et femmes."]
["femmes","hommes","Si ce nombre d'hommes supplémentaires avait bénéficié d'une augmentation, les taux d'augmentation seraient égaux entre hommes et femmes."]
["femmes","égal",{"$f":"C8","v":"Si ce nombre d'hommes supplémentaires avait bénéficié d'une augmentation, les taux d'augmentation seraient égaux entre hommes et femmes."}]
["aucun","femmes"]
["aucun","hommes"]
["aucun","égal"]

{"sheet":"3- AI maternité","index":4,"n_rows":14,"n_cols":4,"rows_kept":14,"cut":false,"hidden":false,"merged":[[0,0,0,12],[8,0,8,3],[9,0,9,3],[12,0,12,1],[13,3,13,12],[5,0,6,0],[5,1,5,2],[5,3,6,3]]}
["3- pourcentage de salariés ayant bénéficié d'une augmentation dans l'année suivant leur retour de congé maternité"]
[]
["Saisir vos données dans les seules cellules vertes. Ne rien saisir dans les autres cellules. "]
["Les résultats apparaissent dans les cellules jaunes. Ils peuvent être accompagnés de commmentaires pour les interpréter. "]
[]
[null,"nombre de salariés de retour de congé maternité/adoption*",null,"pourcentage de salariés augmentés"]
[null,"total","augmentés**"]
["ensemble des salariés",null,null,{"$f":"IF(C12=1, IF(AND(C8>=0,C8<=B8),C8/B8,\"ERREUR\"),\" \")","v":" "}]
["*  Les salariés à considérer sont les salariés revenus de congé maternité ou d’adoption (éventuellement prolongé par un congé parental) pendant la période de référence, et durant lequel sont intervenues des augmentations générales et/ou individuelles pour les salariés relevant de la même catégorie professionnelle, ou à défaut, pour l’ensemble des salariés de l’entreprise. Même si ces salariés ont été absents plus de la moitié de la période de référence, ils doivent être pris en compte pour le calcul de l'indicateur. "]
["** Les augmentations à prendre en compte sont celles qui sont intervenues soit pendant le congé maternité/adoption, soit à son retour, avant la fin de la période de référence."]
[]
["indicateur calculable (1=oui, 0=non) :",null,{"$f":"IF(ISBLANK(B8),\"#N/A\",IF(B8>0,1,0))","v":"#N/A"},{"$f":"IF(C12=1,\"Il y a eu au moins un retour de congé maternité avec augmentation pendant ce congé.\",IF(C12=0,\"Il n'y a pas eu de retour de congé maternité avec augmentation pendant ce congé.\",\" \"))","v":" "}]
["indicateur de pourcentage de salariés ayant bénéficié d'une augmentation dans l'année suivant leur retour de congé maternité (%) :",null,{"$f":"IF(C12=1,ABS(ROUND(100*D8,1)),IF(C12=0,\"INCALCULABLE\",\"#N/A\"))","v":"#N/A"}]
["note obtenue sur 15 :",null,{"$f":"VLOOKUP(C13,barèmes!H5:I6,2)","v":{"$error":"#N/A"}},{"$f":"IF(C14=0,\"Les salariés de retour de congé maternité ou d’adoption, durant lequel des augmentations sont intervenues, n’ont pas tous été augmentés. Aucun point n’est accordé.\",IF(C14=MAX(barèmes!I5:I6),\"Tous les salariés de retour de congé maternité ou d’adoption, durant lequel des augmentations sont intervenues, ont été augmentés. Tous les points sont accordés.\",\" \"))","v":{"$error":"#N/A"}}]

{"sheet":"4- 10 + hautes rému","index":5,"n_rows":12,"n_cols":5,"rows_kept":12,"cut":false,"hidden":false,"merged":[[5,1,5,3],[5,0,6,0],[5,4,6,4],[10,0,10,1]]}
["4- nombre de salariés du sexe sous-représenté parmi les 10 plus hautes rémunérations"]
[]
["Saisir vos données dans les seules cellules vertes. Ne rien saisir dans les autres cellules. "]
["Les résultats apparaissent dans les cellules jaunes. Ils peuvent être accompagnés de commmentaires pour les interpréter. "]
[]
[null,"Nombre de salariés parmi les 10 plus hautes rémunérations*",null,null,"nombre de salariés du sexe sous-représenté"]
[null,"femmes","hommes","ensemble"]
["ensemble des salariés",null,null,{"$f":"B8+C8","v":0},{"$f":"IF(D8=10,MIN(B8,C8),\"TOTAL différent de 10\")","v":"TOTAL différent de 10"}]
["* Les rémunérations à considérer sont les rémunérations brutes annuelles par EQTP utilisées pour l'indicateur 1."]
[]
["indicateur du nombre de salariés du sexe sous-représenté parmi les 10 plus hautes rémunérations :",null,{"$f":"E8","v":"TOTAL différent de 10"},{"$f":"IF(D8=10,IF(B8>C8,\"Les hommes sont sous-représentés parmi les salariés les mieux rémunérés.\",IF(C8>B8,\"Les femmes sont sous-représentées parmi les salariés les mieux rémunérés.\",\"Les hommes et les femmes sont à parité parmi les salariés les mieux rémunérés.\")),\" \")","v":" "}]
["note obtenue sur 10 :",null,{"$f":"VLOOKUP(C11,barèmes!K5:L7,2)","v":{"$error":"#N/A"}}]

{"sheet":"index","index":6,"n_rows":12,"n_cols":6,"rows_kept":12,"cut":false,"hidden":false,"merged":[]}
["Calcul de l'index d'égalité professionnelle femmes-hommes"]
[]
["Calculs automatiques, ne pas modifier."]
[]
[null,"indicateur calculable (1=oui, 0=non)","valeur de l'indicateur","points obtenus","nombre de points maximum de l'indicateur","nombre de points maximum des indicateurs calculables"]
["1- écart de remuneration (en %)",{"$f":"'1- écart rémunération'!D28","v":"#N/A"},{"$f":"'1- écart rémunération'!D29","v":"#N/A"},{"$f":"IF(B6=1,'1- écart rémunération'!D30,\" \")","v":" "},40,{"$f":"B6*E6","v":{"$error":"#VALUE!"}}]
["2- écarts d'augmentations individuelles (en points de % ou en nombre équivalent de salariés)",{"$f":"'2- écart augmentations'!D14","v":"#N/A"},{"$f":"IF(B7=1,MIN('2- écart augmentations'!D15,'2- écart augmentations'!D16),IF(B7=0,\"INCALCULABLE\",\"#N/A\"))","v":"#N/A"},{"$f":"IF(B7=1,'2- écart augmentations'!D20,\" \")","v":" "},35,{"$f":"B7*E7","v":{"$error":"#VALUE!"}}]
["3- pourcentage de salariés augmentés au retour d'un congé maternité (%)",{"$f":"'3- AI maternité'!C12","v":"#N/A"},{"$f":"'3- AI maternité'!C13","v":"#N/A"},{"$f":"IF(B8=1,'3- AI maternité'!C14,\" \")","v":" "},15,{"$error":"#VALUE!"}]
["4- nombre de salariés du sexe sous-représenté parmi les 10 plus hautes rémunérations",1,{"$f":"'4- 10 + hautes rému'!C11","v":"TOTAL différent de 10"},{"$f":"IF(B9=1,'4- 10 + hautes rému'!C12,\" \")","v":{"$error":"#N/A"}},10,10]
["Total des indicateurs calculables",null,null,{"$f":"SUM(D6:D9)","v":{"$error":"#N/A"}},null,{"$f":"SUM(F6:F9)","v":{"$error":"#VALUE!"}}]
["INDEX (sur 100 points)",null,null,{"$f":"IF(F10>=75,D10*100/F10,\"INCALCULABLE\")","v":{"$error":"#VALUE!"}},null,100]
[{"$f":"IF(F10<75,\"L'index est incalculable car le nombre de points maximum des indicateurs calculables est inférieur à 75.\",IF(AND(F10>=75,F10<100),\"Le total des indicateurs calculables est ramené sur 100 points en appliquant la règle de la proportionnalité.\",\" \"))","v":{"$error":"#VALUE!"}}]

{"sheet":"barèmes","index":7,"n_rows":26,"n_cols":12,"rows_kept":26,"cut":false,"hidden":false,"merged":[[2,1,2,2],[2,4,2,5],[2,7,2,8],[2,10,2,11]]}
[]
[null,"Ne pas modifier les barèmes des indicateurs. "]
[null,"Indicateur 1 : écart de rémunération (%)",null,null,"Indicateur 2 : écart de taux d'augmentations individuelles (points de %)",null,null,"Indicateur 3 : pourcentage de salariés ayant bénéficié d'une augmentation dans l'année suivant leur retour de congé maternité (%)",null,null,"Indicateur 4 : nombre de salariés du sexe sous-représenté parmi les 10 plus hautes rémunérations"]
[null,"plancher","note",null,"plancher","note",null,"plancher","note",null,"plancher","note"]
[null,0,40,null,0,35,null,0,0,null,0,0]
[null,0.1,39,null,2.1,25,null,100,15,null,2,5]
[null,{"$f":"B6+1","v":1.1000000000000001},38,null,5.0999999999999996,15,null,null,null,null,4,10]
[null,{"$f":"B7+1","v":2.1},37,null,10.1,0]
[null,3.1,36]
[null,4.0999999999999996,35]
[null,5.0999999999999996,34]
[null,6.1,33]
[null,7.1,31]
[null,8.1,29]
[null,9.1,27]
[null,10.1,25]
[null,11.1,23]
[null,12.1,21]
[null,13.1,19]
[null,14.1,17]
[null,15.1,14]
[null,16.100000000000001,11]
[null,17.100000000000001,8]
[null,18.100000000000001,5]
[null,19.100000000000001,2]
[null,{"$f":"B25+1","v":20.100000000000001},0]